{"text_format":"1","workbook":"xlsx","n_sheets":13,"sheets":["Дашборд","KPI","Сегодня","Шаблон","База заказов","Добавить заказ","Добавить сотрудника","Сотрудники","План KPI","data","today","pivot table","Расчеты"],"not_rendered":{"charts":10,"images":20,"macros":1,"external_links":0,"defined_names":9,"comments":1,"pivot_tables":16},"unopened":[],"bounds":{"document_bytes":16777216,"sheet_cells":100000,"rows_first":2000,"rows_last":500,"rows_between":2000,"halvings":0,"cell_chars":16384,"cell_head_chars":4096},"cells_cut":0,"cells_raw":0,"read":"whole","date_system":"1900"}

{"sheet":"Дашборд","index":0,"n_rows":0,"n_cols":0,"rows_kept":0,"cut":false,"hidden":false,"merged":[]}

{"sheet":"KPI","index":1,"n_rows":26,"n_cols":24,"rows_kept":26,"cut":false,"hidden":false,"merged":[]}
[]
[]
[]
[]
[]
[]
[null,null,null,null,null,null,null,null,{"$f":"IFERROR(INDEX(Сотрудники!$A$3:$A$40,SMALL(IF((Сотрудники!$H$3:$H$40=TRUE)*(Сотрудники!$D$3:$D$40=\"Мастер\"),ROW($E$1:$E$26)),ROW(E1))),\"\")","v":"Белозеров В."},null,null,{"$f":"IFERROR(INDEX(Таблица57[[2019]:[2021]],MATCH(I7,Таблица57[ФИО],0),MATCH(TEXT(Расчеты!$D$2,\"ГГГГ\"),Таблица57[[#Headers],[2019]:[2021]],0)),\"\")","v":15000},null,{"$f":"Расчеты!I3","v":6},null,{"$f":"IFERROR(VLOOKUP(I7,'pivot table'!AH:AI,2,FALSE),\"\")","v":5},null,{"$f":"IFERROR(P7/$N$7,\"\")","v":0.83333333333333337},null,{"$f":"IFERROR(VLOOKUP(I7,Расчеты!S:T,2,FALSE),\"\")","v":15000}]
[null,null,null,null,null,null,null,null,{"$f":"IFERROR(INDEX(Сотрудники!$A$3:$A$40,SMALL(IF((Сотрудники!$H$3:$H$40=TRUE)*(Сотрудники!$D$3:$D$40=\"Мастер\"),ROW($E$1:$E$26)),ROW(E2))),\"\")","v":"Белоусов В."},null,null,{"$f":"IFERROR(INDEX(Таблица57[[2019]:[2021]],MATCH(I8,Таблица57[ФИО],0),MATCH(TEXT(Расчеты!$D$2,\"ГГГГ\"),Таблица57[[#Headers],[2019]:[2021]],0)),\"\")","v":15000},null,null,null,{"$f":"IFERROR(VLOOKUP(I8,'pivot table'!AH:AI,2,FALSE),\"\")","v":3},null,{"$f":"IFERROR(P8/$N$7,\"\")","v":0.5},null,{"$f":"IFERROR(VLOOKUP(I8,Расчеты!S:T,2,FALSE),\"\")","v":15000}]
{"$rows_left_out":19}
{"sheet":"Сегодня","index":2,"n_rows":0,"n_cols":0,"rows_kept":0,"cut":false,"hidden":false,"merged":[]}

{"sheet":"Шаблон","index":3,"n_rows":10,"n_cols":5,"rows_kept":10,"cut":false,"hidden":false,"merged":[[9,4,18,9]]}
[]
[]
[]
[]
[]
[]
[]
[]
{"$rows_left_out":3}
{"sheet":"База заказов","index":4,"n_rows":766,"n_cols":25,"rows_kept":766,"cut":false,"hidden":false,"merged":[]}
["Дата заявки","День","Месяц","Год","Менеджер","Услуга","Наличн","Безнал","Скидка","Итого","Дата визита","День визита","Месяц визита","Год визита","Неделя визита","Время визита","Адрес","Мастер","Клиент","E-mail","Телефон","Трафик","Статус","Уведомление","Оценка клиента"]
[43466,{"$f":"DAY('База заказов'!$A2)","v":1},{"$f":"'База заказов'!$A2","v":"2019-01-01"},{"$f":"YEAR('База заказов'!$A2)","v":2019},"Иванов И.","Демонтаж балконного блока",20000,null,null,{"$f":"SUM(Table[[#This Row],[Наличн]:[Безнал]])-SUM(Table[[#This Row],[Наличн]:[Безнал]])*Table[[#This Row],[Скидка]]","v":20000},43467,null,null,null,null,"10:30:00","Ростов-на-Дону, Горького 151","Белоусов В.","Клиент 1","mail@birdyx.ru","79008889900","Авито","Завершено","да",5]
[43467,{"$f":"DAY('База заказов'!$A3)","v":2},{"$f":"'База заказов'!$A3","v":"2019-01-02"},{"$f":"YEAR('База заказов'!$A3)","v":2019},"Гончарова Н.","Укладка паркетной доски на клей",120000,null,null,{"$f":"SUM(Table[[#This Row],[Наличн]:[Безнал]])-SUM(Table[[#This Row],[Наличн]:[Безнал]])*Table[[#This Row],[Скидка]]","v":120000},43468,null,null,null,null,"10:00:00","Ростов-на-Дону, Стартовая 18","Субботин С.","Клиент 2","mail@birdyx.ru","79008889900","Авито","Завершено","да",4]
[43468,{"$f":"DAY('База заказов'!$A4)","v":3},{"$f":"'База заказов'!$A4","v":"2019-01-03"},{"$f":"YEAR('База заказов'!$A4)","v":2019},"Мишин М.","Укладка кварцвиниловой плитки на подложку",34500,null,null,{"$f":"SUM(Table[[#This Row],[Наличн]:[Безнал]])-SUM(Table[[#This Row],[Наличн]:[Безнал]])*Table[[#This Row],[Скидка]]","v":34500},43469,null,null,null,null,"12:00:00","Ростов-на-Дону, Жданова 15","Белозеров В.","Клиент 3","mail@birdyx.ru","79008889900","Яндекс","Завершено","да",4]
[43469,{"$f":"DAY('База заказов'!$A5)","v":4},{"$f":"'База заказов'!$A5","v":"2019-01-04"},{"$f":"YEAR('База заказов'!$A5)","v":2019},"Иванов И.","Укладка паркетной доски на подложку",12000,null,null,{"$f":"SUM(Table[[#This Row],[Наличн]:[Безнал]])-SUM(Table[[#This Row],[Наличн]:[Безнал]])*Table[[#This Row],[Скидка]]","v":12000},43470,null,null,null,null,"16:00:00","Ростов-на-Дону, ул. Пацаева, д. 2","Устинов С.","Клиент 4","mail@birdyx.ru","79008889900","Авито","Завершено","да",4]
[43470,{"$f":"DAY('База заказов'!$A6)","v":5},{"$f":"'База заказов'!$A6","v":"2019-01-05"},{"$f":"YEAR('База заказов'!$A6)","v":2019},"Петров В.","Укладка массивной доски",20000,null,null,{"$f":"SUM(Table[[#This Row],[Наличн]:[Безнал]])-SUM(Table[[#This Row],[Наличн]:[Безнал]])*Table[[#This Row],[Скидка]]","v":20000},43471,null,null,null,null,"10:30:00","Ростов-на-Дону, Горького 151","Белозеров В.","Клиент 5","mail@birdyx.ru","79008889900","Авито","Завершено","да",4]
[43497,{"$f":"DAY('База заказов'!$A7)","v":1},{"$f":"'База заказов'!$A7","v":"2019-02-01"},{"$f":"YEAR('База заказов'!$A7)","v":2019},"Гончарова Н.","Монтаж потолочного плинтуса",6000,null,null,{"$f":"SUM(Table[[#This Row],[Наличн]:[Безнал]])-SUM(Table[[#This Row],[Наличн]:[Безнал]])*Table[[#This Row],[Скидка]]","v":6000},43499,null,null,null,null,"10:30:00","Ростов-на-Дону, Комарова, 24","Беспалов Г.","Клиент 6","mail@birdyx.ru","79008889900","Авито","Завершено","да",4]
[43498,{"$f":"DAY('База заказов'!$A8)","v":2},{"$f":"'База заказов'!$A8","v":"2019-02-02"},{"$f":"YEAR('База заказов'!$A8)","v":2019},"Гончарова Н.","Укладка массивной доски",340000,null,null,{"$f":"SUM(Table[[#This Row],[Наличн]:[Безнал]])-SUM(Table[[#This Row],[Наличн]:[Безнал]])*Table[[#This Row],[Скидка]]","v":340000},43500,null,null,null,null,"10:00:00","Ростов-На-Дону, ул. Извилистая, д. 13/2","Устинов С.","Клиент 7","mail@birdyx.ru","79008889900","Яндекс","Завершено","да",4]
{"$rows_left_out":759}
{"sheet":"Добавить заказ","index":5,"n_rows":20,"n_cols":14,"rows_kept":20,"cut":false,"hidden":false,"merged":[[19,6,19,14],[16,1,16,4],[19,1,19,4],[7,6,7,9],[10,6,10,9],[13,6,13,9],[16,6,16,9],[7,11,7,14],[10,11,10,14],[7,1,7,4],[10,1,10,4],[13,1,13,4],[13,11,13,14],[1,11,1,12],[1,8,1,10],[1,13,1,14],[16,11,16,14],[18,6,18,14]]}
[]
[null,null,null,null,null,null,null,null,"Менеджер",null,null,null,null,{"$f":"TODAY()","v":44541}]
[]
[null,"Заказчик",null,null,null,null,"Подробнее",null,null,null,null,"Оплата"]
[]
[]
[null,"ФИО",null,null,null,null,"Услуга",null,null,null,null,"Кол-во (шт, кв.м и др)"]
[]
{"$rows_left_out":13}
{"sheet":"Добавить сотрудника","index":6,"n_rows":17,"n_cols":2,"rows_kept":17,"cut":false,"hidden":false,"merged":[[12,17,12,19],[17,18,17,19],[4,1,4,6],[7,1,7,6],[10,1,10,6],[13,1,13,6],[16,1,16,6],[9,16,9,19],[10,18,10,19],[11,17,11,19]]}
[]
[]
[]
[null,"Фамилия И."]
[]
[]
[null,"Дата рождения"]
[]
{"$rows_left_out":10}
{"sheet":"Сотрудники","index":7,"n_rows":15,"n_cols":11,"rows_kept":15,"cut":false,"hidden":false,"merged":[[0,8,0,10]]}
["Сотрудники",null,null,null,null,null,null,null,"Оклад"]
["ФИО","Дата\nрождения","ДР в дашборд","Должность","Дата\nпринятия","Дата\nувольнения","Статус","Выборка","2019","2020","2021"]
["Белозеров В.",32765,{"$f":"IF(MONTH(Таблица57[[#This Row],[Дата\nрождения]])=MONTH(Расчеты!$D$2),\"др\",\"\")","v":""},"Мастер",43435," ",{"$f":"IF(Таблица57[[#This Row],[Дата\nувольнения]]<>\" \",\"уволен\",\"\")","v":""},{"$f":"IF(OR(Расчеты!$D$2>Таблица57[[#This Row],[Дата\nувольнения]],Расчеты!$D$2<Таблица57[[#This Row],[Дата\nпринятия]]),FALSE,TRUE)","v":true},10000,12000,15000]
["Белоусов В.",26666,{"$f":"IF(MONTH(Таблица57[[#This Row],[Дата\nрождения]])=MONTH(Расчеты!$D$2),\"др\",\"\")","v":""},"Мастер",43435," ",{"$f":"IF(Таблица57[[#This Row],[Дата\nувольнения]]<>\" \",\"уволен\",\"\")","v":""},{"$f":"IF(OR(Расчеты!$D$2>Таблица57[[#This Row],[Дата\nувольнения]],Расчеты!$D$2<Таблица57[[#This Row],[Дата\nпринятия]]),FALSE,TRUE)","v":true},10000,12000,15000]
["Беспалов Г.",24521,{"$f":"IF(MONTH(Таблица57[[#This Row],[Дата\nрождения]])=MONTH(Расчеты!$D$2),\"др\",\"\")","v":""},"Мастер",43450," ",{"$f":"IF(Таблица57[[#This Row],[Дата\nувольнения]]<>\" \",\"уволен\",\"\")","v":""},{"$f":"IF(OR(Расчеты!$D$2>Таблица57[[#This Row],[Дата\nувольнения]],Расчеты!$D$2<Таблица57[[#This Row],[Дата\nпринятия]]),FALSE,TRUE)","v":true},10000,12000,15000]
["Минин В.",33094,{"$f":"IF(MONTH(Таблица57[[#This Row],[Дата\nрождения]])=MONTH(Расчеты!$D$2),\"др\",\"\")","v":""},"Мастер",43450,44509,{"$f":"IF(Таблица57[[#This Row],[Дата\nувольнения]]<>\" \",\"уволен\",\"\")","v":"уволен"},{"$f":"IF(OR(Расчеты!$D$2>Таблица57[[#This Row],[Дата\nувольнения]],Расчеты!$D$2<Таблица57[[#This Row],[Дата\nпринятия]]),FALSE,TRUE)","v":true},10000,12000,15000]
["Субботин С.",29177,{"$f":"IF(MONTH(Таблица57[[#This Row],[Дата\nрождения]])=MONTH(Расчеты!$D$2),\"др\",\"\")","v":"др"},"Мастер",43450," ",{"$f":"IF(Таблица57[[#This Row],[Дата\nувольнения]]<>\" \",\"уволен\",\"\")","v":""},{"$f":"IF(OR(Расчеты!$D$2>Таблица57[[#This Row],[Дата\nувольнения]],Расчеты!$D$2<Таблица57[[#This Row],[Дата\nпринятия]]),FALSE,TRUE)","v":true},10000,12000,15000]
["Устинов С.",34906,{"$f":"IF(MONTH(Таблица57[[#This Row],[Дата\nрождения]])=MONTH(Расчеты!$D$2),\"др\",\"\")","v":""},"Мастер",43450," ",{"$f":"IF(Таблица57[[#This Row],[Дата\nувольнения]]<>\" \",\"уволен\",\"\")","v":""},{"$f":"IF(OR(Расчеты!$D$2>Таблица57[[#This Row],[Дата\nувольнения]],Расчеты!$D$2<Таблица57[[#This Row],[Дата\nпринятия]]),FALSE,TRUE)","v":true},8000,10000,12000]
{"$rows_left_out":8}
{"sheet":"План KPI","index":8,"n_rows":38,"n_cols":6,"rows_kept":38,"cut":false,"hidden":false,"merged":[]}
["ПЛАН","Менеджеры","Мастера","<100%","100%",">100%"]
[null,"Продажи","Число заказов"]
["2019-01-01",150000,4,0,5000,0.03]
["2019-02-01",150000,4,0,5000,0.03]
["2019-03-01",150000,4,0,5000,0.03]
["2019-04-01",150000,4,0,5000,0.03]
["2019-05-01",150000,4,0,5000,0.03]
["2019-06-01",150000,5,0,5000,0.03]
{"$rows_left_out":31}
{"sheet":"data","index":9,"n_rows":29,"n_cols":7,"rows_kept":29,"cut":false,"hidden":false,"merged":[]}
[null,"Данные для выпадающих списков"]
[]
[null,"Услуги","Цена",null,"Статус",null,"Трафик"]
[null,"Демонтаж душевой кабины",25000,null,"В работе",null,"Сайт"]
[null,"Демонтаж душевого поддона",34000,null,"Отмена",null,"Авито"]
[null,"Демонтаж раковины",12000,null,"Завершено",null,"Инстаграм"]
[null,"Демонтаж входной двери",5000,null,null,null,"Яндекс"]
[null,"Демонтаж оконного блока",5600,null,null,null,"По совету"]
{"$rows_left_out":22}
{"sheet":"today","index":10,"n_rows":14,"n_cols":18,"rows_kept":14,"cut":false,"hidden":true,"merged":[]}
["Статус","(несколько элементов)","Статус","(несколько элементов)",null,null,"Статус","В работе","Телефон","Услуга","Мастер","Время",5,null,"Названия строк","Количество по полю Статус"]
[null,null,null,null,null,null,null,null,null,null,null,null,"Позиция в базе","Уведомление",44541,5]
["Названия строк",null,"Названия строк","Сумма по полю Итого",null,null,"Названия строк",null,null,null,null,null,null,null,"В работе",5,"В работе",{"$f":"IFERROR(VLOOKUP(Q3,O:P,2,FALSE),0)","v":5}]
[44541,null,44541,187800,null,null,44541,null,null,null,null,null,null,null,null,null,"Завершено",{"$f":"IFERROR(VLOOKUP(Q4,O:P,2,FALSE),0)","v":0}]
["Ростов-На-Дону, пер. Семашко, д. 46/1",null,null,null,null,null,"Клиент 743",null,{"$f":"IFERROR(INDEX(Table[Телефон],MATCH(today!G5,Table[Клиент],0)),\"\")","v":"79008889900"},{"$f":"IFERROR(INDEX(Table[Услуга],MATCH(today!G5,Table[Клиент],0)),\"\")","v":"Выкройка и монтаж дополнительных углов"},{"$f":"IFERROR(INDEX(Table[Мастер],MATCH(today!G5,Table[Клиент],0)),\"\")","v":"Беспалов Г."},{"$f":"IFERROR(INDEX(Table[Время визита],MATCH(today!G5,Table[Клиент],0)),\"\")","v":"10:00:00"},{"$f":"IFERROR(MATCH(TODAY()&G5,'База заказов'!K:K&'База заказов'!S:S,0),\"\")","v":744},{"$f":"IF(IFERROR(INDEX('База заказов'!X:X,today!M5),\"\")=\"да\",\"a\",\"\")","v":""},null,null,"Отмена",{"$f":"IFERROR(VLOOKUP(Q5,O:P,2,FALSE),0)","v":0}]
["Ростов-на-Дону, проспект Коммунистический, д. 20/4",null,null,null,null,null,"Клиент 744",null,{"$f":"IFERROR(INDEX(Table[Телефон],MATCH(today!G6,Table[Клиент],0)),\"\")","v":"79008889900"},{"$f":"IFERROR(INDEX(Table[Услуга],MATCH(today!G6,Table[Клиент],0)),\"\")","v":"Установка плинтуса ПВХ"},{"$f":"IFERROR(INDEX(Table[Мастер],MATCH(today!G6,Table[Клиент],0)),\"\")","v":"Белозеров В."},{"$f":"IFERROR(INDEX(Table[Время визита],MATCH(today!G6,Table[Клиент],0)),\"\")","v":"12:00:00"},{"$f":"IFERROR(MATCH(TODAY()&G6,'База заказов'!K:K&'База заказов'!S:S,0),\"\")","v":745},{"$f":"IF(IFERROR(INDEX('База заказов'!X:X,today!M6),\"\")=\"да\",\"a\",\"\")","v":""}]
["Ростов-на-Дону, проспект Соколова, д. 11/Б",null,null,null,null,null,"Клиент 745",null,{"$f":"IFERROR(INDEX(Table[Телефон],MATCH(today!G7,Table[Клиент],0)),\"\")","v":"79008889900"},{"$f":"IFERROR(INDEX(Table[Услуга],MATCH(today!G7,Table[Клиент],0)),\"\")","v":"Монтаж реечных потолков"},{"$f":"IFERROR(INDEX(Table[Мастер],MATCH(today!G7,Table[Клиент],0)),\"\")","v":"Устинов С."},{"$f":"IFERROR(INDEX(Table[Время визита],MATCH(today!G7,Table[Клиент],0)),\"\")","v":"16:00:00"},{"$f":"IFERROR(MATCH(TODAY()&G7,'База заказов'!K:K&'База заказов'!S:S,0),\"\")","v":746},{"$f":"IF(IFERROR(INDEX('База заказов'!X:X,today!M7),\"\")=\"да\",\"a\",\"\")","v":""}]
["Ростов-на-Дону, ул. Ларина, д. 41/19",null,null,null,null,null,"Клиент 746",null,{"$f":"IFERROR(INDEX(Table[Телефон],MATCH(today!G8,Table[Клиент],0)),\"\")","v":"79008889900"},{"$f":"IFERROR(INDEX(Table[Услуга],MATCH(today!G8,Table[Клиент],0)),\"\")","v":"Монтаж реечных потолков"},{"$f":"IFERROR(INDEX(Table[Мастер],MATCH(today!G8,Table[Клиент],0)),\"\")","v":"Минин В."},{"$f":"IFERROR(INDEX(Table[Время визита],MATCH(today!G8,Table[Клиент],0)),\"\")","v":"18:00:00"},{"$f":"IFERROR(MATCH(TODAY()&G8,'База заказов'!K:K&'База заказов'!S:S,0),\"\")","v":747},{"$f":"IF(IFERROR(INDEX('База заказов'!X:X,today!M8),\"\")=\"да\",\"a\",\"\")","v":""}]
{"$rows_left_out":7}
{"sheet":"pivot table","index":11,"n_rows":49,"n_cols":44,"rows_kept":49,"cut":false,"hidden":true,"merged":[]}
["Названия строк","Выручка","тыс руб","Названия строк","Выручка",null,"Названия строк","Количество по полю Итого",null,"Названия строк","Количество по полю Безнал","Количество по полю Наличн",null,"Наличные","Безнал",null,"Названия строк","Сумма по полю Итого",null,{"$f":"TODAY()","v":"2021-12-11"},1,"Понедельник","Названия строк","Количество по полю Итого","Среднее по полю Оценка клиента",null,"Названия строк","Количество по полю Статус",null,null,"Названия строк","Количество по полю Статус",null,"Названия строк","Количество по полю Мастер",null,"Названия строк",{"$f":"DATE(AK2,MONTH(VLOOKUP(AK3,AM1:AN12,2,FALSE)),1)","v":44501},"янв",36526,null,"Названия строк","Сумма по полю Итого","текущая выручка"]
["2020",7936115,null,"2020",4476150,null,"2020",1,null,"2020",268,101,null,{"$f":"IFERROR(GETPIVOTDATA(\"Количество по полю Наличн\",$J$1)/SUM(K3:L3),0)","v":0.27371273712737126},{"$f":"IF(N2=0,0,1-N2)","v":0.72628726287262868},null,"2020",7936115,null,{"$f":"VLOOKUP(WEEKDAY(TODAY(),2),U1:V7,2,FALSE)","v":"Суббота"},2,"Вторник","2020",352,4.2244318181818183,null,"2020",352,null,null,"2020",352,null,"2021",null,null,"2021",null,"фев",36557,null,"2021"]
["янв",481945,null,"Демонтаж входной двери",1147640,null,"Сайт",0.43181818181818182,null,"Общий итог",268,101,null,null,null,null,"Гончарова Н.",2238490,null,null,3,"Среда","Белозеров В.",69,4.1739130434782608,null,"Завершено",339,"В работе",{"$f":"IFERROR(VLOOKUP(AC3,AA:AB,2,FALSE),0)","v":0},"Общий итог",352,null,"ноя",27,null,"ноя",null,"мар",36586,null,"ноя",573635]
["фев",734275,null,"Укладка массивной доски",1047205,null,"Авито",0.20738636363636365,null,null,null,null,null,null,null,null,"Иванов И.",2723880,null,null,4,"Четверг","Субботин С.",59,4.2711864406779663,null,"Отмена",13,"Завершено",{"$f":"IFERROR(VLOOKUP(AC4,AA:AB,2,FALSE),0)","v":339},null,null,null,"Белозеров В.",5,null,"Общий итог",null,"апр",36617,null,"Общий итог",573635]
["мар",722035,null,"Укладка паркетной доски на клей",851600,null,"Инстаграм",0.14488636363636365,null,null,null,null,null,null,null,null,"Мишин М.",1246940,null,null,5,"Пятница","Беспалов Г.",56,4.2321428571428568,null,"Общий итог",352,"Отмена",13,null,null,null,"Белоусов В.",3,null,null,null,"май",36647]
["апр",691380,null,"Монтаж потолочного плинтуса",808975,null,"Яндекс",0.13068181818181818,null,null,null,null,null,null,null,null,"Петров В.",1726805,null,null,6,"Суббота","Белоусов В.",51,4.4117647058823533,null,null,null,null,null,null,null,null,"Беспалов Г.",2,null,null,null,"июн",36678]
["май",635145,null,"Нанесение декоративной штукатурки ",620730,null,"По совету",8.5227272727272721E-2,null,null,null,null,null,null,null,null,null,null,null,null,7,"Воскресенье","Минин В.",48,4.270833333333333,null,null,null,null,null,null,null,null,"Минин В.",4,null,null,null,"июл",36708]
["июн",652400,null,"Общий итог",4476150,null,"Общий итог",1,null,null,null,null,null,null,null,null,null,null,null,null,null,null,"Шарапов В.",39,3.8205128205128207,null,null,null,null,null,null,null,null,"Субботин С.",3,null,null,null,"авг",36739]
{"$rows_left_out":42}
{"sheet":"Расчеты","index":12,"n_rows":26,"n_cols":20,"rows_kept":26,"cut":false,"hidden":true,"merged":[[0,7,0,8],[0,10,0,12],[0,13,2,13]]}
["День рождения",null,null,"Текущий выбор на листе KPI",null,null,null,"План",null,null,"KPI",null,null,"Текущий список","Мастер","Менеджер",null,"ЗП",{"$f":"IFERROR(INDEX(Сотрудники!$A$3:$A$40,SMALL(IF(Сотрудники!$H$3:$H$40=TRUE,ROW($E$1:$E$37)),ROW(E1))),\"\")","v":"Белозеров В."},{"$f":"IFERROR(IF(VLOOKUP(S1,KPI!I:R,10,FALSE)<1,$K$3+VLOOKUP(S1,KPI!I:L,4,FALSE),IF(VLOOKUP(S1,KPI!I:R,10,FALSE)=1,Расчеты!$L$3+VLOOKUP(S1,KPI!I:L,4,FALSE),IF(VLOOKUP(S1,KPI!I:R,10,FALSE)>1,Расчеты!$M$3*'pivot table'!$AQ$4+VLOOKUP(S1,KPI!I:L,4,FALSE),\"\"))),\"\")","v":15000}]
["ФИО","Дата",null,{"$f":"'pivot table'!AL1","v":44501},null,null,null,"Менеджеры",{"$f":"IFERROR(VLOOKUP(D2,Таблица1[],2,FALSE),0)","v":230000},null,"<100%","100%",">100%",null,{"$f":"IFERROR(INDEX(Сотрудники!$A$3:$A$40,SMALL(IF((Сотрудники!$D$3:$D$40=\"Мастер\")*(Сотрудники!$G$3:$G$40=\"\"),ROW($E$1:$E$37)),ROW(E1))),\"\")","v":"Белозеров В."},{"$f":"IFERROR(INDEX(Сотрудники!$A$3:$A$40,SMALL(IF((Сотрудники!$D$3:$D$40=\"Менеджер\")*(Сотрудники!$G$3:$G$40=\"\"),ROW($E$1:$E$37)),ROW(E1))),\"\")","v":"Гончарова Н."},null,{"$f":"SUM(T1:T26)","v":182000},{"$f":"IFERROR(INDEX(Сотрудники!$A$3:$A$40,SMALL(IF(Сотрудники!$H$3:$H$40=TRUE,ROW($E$1:$E$37)),ROW(E2))),\"\")","v":"Белоусов В."},{"$f":"IFERROR(IF(VLOOKUP(S2,KPI!I:R,10,FALSE)<1,$K$3+VLOOKUP(S2,KPI!I:L,4,FALSE),IF(VLOOKUP(S2,KPI!I:R,10,FALSE)=1,Расчеты!$L$3+VLOOKUP(S2,KPI!I:L,4,FALSE),IF(VLOOKUP(S2,KPI!I:R,10,FALSE)>1,Расчеты!$M$3*'pivot table'!$AQ$4+VLOOKUP(S2,KPI!I:L,4,FALSE),\"\"))),\"\")","v":15000}]
[{"$f":"IFERROR(INDEX(Сотрудники!$A$3:$A$40,SMALL(IF((Сотрудники!$C$3:$C$40=\"др\")*(Сотрудники!$G$3:$G$40=\"\"),ROW($E$1:$E$37)),ROW(E1))),\"\")","v":"Субботин С."},{"$f":"IFERROR(TEXT(VLOOKUP(A3,Сотрудники!A:C,2,FALSE),\"ДД МММ\"),\"\")","v":"18 ноя"},null,null,null,null,null,"Мастера",{"$f":"IFERROR(VLOOKUP(D2,Таблица1[],3,FALSE),0)","v":6},null,{"$f":"IFERROR(VLOOKUP(D2,Таблица1[],4,FALSE),0)","v":0},{"$f":"IFERROR(VLOOKUP(D2,Таблица1[],5,FALSE),0)","v":5000},{"$f":"IFERROR(VLOOKUP(D2,Таблица1[],6,FALSE),0)","v":0.03},null,{"$f":"IFERROR(INDEX(Сотрудники!$A$3:$A$40,SMALL(IF((Сотрудники!$D$3:$D$40=\"Мастер\")*(Сотрудники!$G$3:$G$40=\"\"),ROW($E$1:$E$37)),ROW(E2))),\"\")","v":"Белоусов В."},{"$f":"IFERROR(INDEX(Сотрудники!$A$3:$A$40,SMALL(IF((Сотрудники!$D$3:$D$40=\"Менеджер\")*(Сотрудники!$G$3:$G$40=\"\"),ROW($E$1:$E$37)),ROW(E2))),\"\")","v":"Иванов И."},null,"Чистая прибыль",{"$f":"IFERROR(INDEX(Сотрудники!$A$3:$A$40,SMALL(IF(Сотрудники!$H$3:$H$40=TRUE,ROW($E$1:$E$37)),ROW(E3))),\"\")","v":"Беспалов Г."},{"$f":"IFERROR(IF(VLOOKUP(S3,KPI!I:R,10,FALSE)<1,$K$3+VLOOKUP(S3,KPI!I:L,4,FALSE),IF(VLOOKUP(S3,KPI!I:R,10,FALSE)=1,Расчеты!$L$3+VLOOKUP(S3,KPI!I:L,4,FALSE),IF(VLOOKUP(S3,KPI!I:R,10,FALSE)>1,Расчеты!$M$3*'pivot table'!$AQ$4+VLOOKUP(S3,KPI!I:L,4,FALSE),\"\"))),\"\")","v":15000}]
[{"$f":"IFERROR(INDEX(Сотрудники!$A$3:$A$40,SMALL(IF((Сотрудники!$C$3:$C$40=\"др\")*(Сотрудники!$G$3:$G$40=\"\"),ROW($E$1:$E$37)),ROW(E2))),\"\")","v":""},{"$f":"IFERROR(TEXT(VLOOKUP(A4,Сотрудники!A:C,2,FALSE),\"ДД МММ\"),\"\")","v":""},null,null,null,null,null,null,null,null,null,null,null,null,{"$f":"IFERROR(INDEX(Сотрудники!$A$3:$A$40,SMALL(IF((Сотрудники!$D$3:$D$40=\"Мастер\")*(Сотрудники!$G$3:$G$40=\"\"),ROW($E$1:$E$37)),ROW(E3))),\"\")","v":"Беспалов Г."},{"$f":"IFERROR(INDEX(Сотрудники!$A$3:$A$40,SMALL(IF((Сотрудники!$D$3:$D$40=\"Менеджер\")*(Сотрудники!$G$3:$G$40=\"\"),ROW($E$1:$E$37)),ROW(E3))),\"\")","v":"Мишин М."},null,{"$f":"IFERROR('pivot table'!AQ4-Расчеты!R2,\"\")","v":391635},{"$f":"IFERROR(INDEX(Сотрудники!$A$3:$A$40,SMALL(IF(Сотрудники!$H$3:$H$40=TRUE,ROW($E$1:$E$37)),ROW(E4))),\"\")","v":"Минин В."},{"$f":"IFERROR(IF(VLOOKUP(S4,KPI!I:R,10,FALSE)<1,$K$3+VLOOKUP(S4,KPI!I:L,4,FALSE),IF(VLOOKUP(S4,KPI!I:R,10,FALSE)=1,Расчеты!$L$3+VLOOKUP(S4,KPI!I:L,4,FALSE),IF(VLOOKUP(S4,KPI!I:R,10,FALSE)>1,Расчеты!$M$3*'pivot table'!$AQ$4+VLOOKUP(S4,KPI!I:L,4,FALSE),\"\"))),\"\")","v":15000}]
[{"$f":"IFERROR(INDEX(Сотрудники!$A$3:$A$40,SMALL(IF((Сотрудники!$C$3:$C$40=\"др\")*(Сотрудники!$G$3:$G$40=\"\"),ROW($E$1:$E$37)),ROW(E3))),\"\")","v":""},{"$f":"IFERROR(TEXT(VLOOKUP(A5,Сотрудники!A:C,2,FALSE),\"ДД МММ\"),\"\")","v":""},null,null,null,null,null,null,null,null,null,null,null,null,{"$f":"IFERROR(INDEX(Сотрудники!$A$3:$A$40,SMALL(IF((Сотрудники!$D$3:$D$40=\"Мастер\")*(Сотрудники!$G$3:$G$40=\"\"),ROW($E$1:$E$37)),ROW(E4))),\"\")","v":"Субботин С."},{"$f":"IFERROR(INDEX(Сотрудники!$A$3:$A$40,SMALL(IF((Сотрудники!$D$3:$D$40=\"Менеджер\")*(Сотрудники!$G$3:$G$40=\"\"),ROW($E$1:$E$37)),ROW(E4))),\"\")","v":"Сергеев М."},null,null,{"$f":"IFERROR(INDEX(Сотрудники!$A$3:$A$40,SMALL(IF(Сотрудники!$H$3:$H$40=TRUE,ROW($E$1:$E$37)),ROW(E5))),\"\")","v":"Субботин С."},{"$f":"IFERROR(IF(VLOOKUP(S5,KPI!I:R,10,FALSE)<1,$K$3+VLOOKUP(S5,KPI!I:L,4,FALSE),IF(VLOOKUP(S5,KPI!I:R,10,FALSE)=1,Расчеты!$L$3+VLOOKUP(S5,KPI!I:L,4,FALSE),IF(VLOOKUP(S5,KPI!I:R,10,FALSE)>1,Расчеты!$M$3*'pivot table'!$AQ$4+VLOOKUP(S5,KPI!I:L,4,FALSE),\"\"))),\"\")","v":15000}]
[{"$f":"IFERROR(INDEX(Сотрудники!$A$3:$A$40,SMALL(IF((Сотрудники!$C$3:$C$40=\"др\")*(Сотрудники!$G$3:$G$40=\"\"),ROW($E$1:$E$37)),ROW(E4))),\"\")","v":""},{"$f":"IFERROR(TEXT(VLOOKUP(A6,Сотрудники!A:C,2,FALSE),\"ДД МММ\"),\"\")","v":""},null,null,null,null,null,null,null,null,null,null,null,null,{"$f":"IFERROR(INDEX(Сотрудники!$A$3:$A$40,SMALL(IF((Сотрудники!$D$3:$D$40=\"Мастер\")*(Сотрудники!$G$3:$G$40=\"\"),ROW($E$1:$E$37)),ROW(E5))),\"\")","v":"Устинов С."},{"$f":"IFERROR(INDEX(Сотрудники!$A$3:$A$40,SMALL(IF((Сотрудники!$D$3:$D$40=\"Менеджер\")*(Сотрудники!$G$3:$G$40=\"\"),ROW($E$1:$E$37)),ROW(E5))),\"\")","v":""},null,null,{"$f":"IFERROR(INDEX(Сотрудники!$A$3:$A$40,SMALL(IF(Сотрудники!$H$3:$H$40=TRUE,ROW($E$1:$E$37)),ROW(E6))),\"\")","v":"Устинов С."},{"$f":"IFERROR(IF(VLOOKUP(S6,KPI!I:R,10,FALSE)<1,$K$3+VLOOKUP(S6,KPI!I:L,4,FALSE),IF(VLOOKUP(S6,KPI!I:R,10,FALSE)=1,Расчеты!$L$3+VLOOKUP(S6,KPI!I:L,4,FALSE),IF(VLOOKUP(S6,KPI!I:R,10,FALSE)>1,Расчеты!$M$3*'pivot table'!$AQ$4+VLOOKUP(S6,KPI!I:L,4,FALSE),\"\"))),\"\")","v":12000}]
[{"$f":"IFERROR(INDEX(Сотрудники!$A$3:$A$40,SMALL(IF((Сотрудники!$C$3:$C$40=\"др\")*(Сотрудники!$G$3:$G$40=\"\"),ROW($E$1:$E$37)),ROW(E5))),\"\")","v":""},{"$f":"IFERROR(TEXT(VLOOKUP(A7,Сотрудники!A:C,2,FALSE),\"ДД МММ\"),\"\")","v":""},null,null,null,null,null,null,null,null,null,null,null,null,{"$f":"IFERROR(INDEX(Сотрудники!$A$3:$A$40,SMALL(IF((Сотрудники!$D$3:$D$40=\"Мастер\")*(Сотрудники!$G$3:$G$40=\"\"),ROW($E$1:$E$37)),ROW(E6))),\"\")","v":"Шарапов В."},{"$f":"IFERROR(INDEX(Сотрудники!$A$3:$A$40,SMALL(IF((Сотрудники!$D$3:$D$40=\"Менеджер\")*(Сотрудники!$G$3:$G$40=\"\"),ROW($E$1:$E$37)),ROW(E6))),\"\")","v":""},null,null,{"$f":"IFERROR(INDEX(Сотрудники!$A$3:$A$40,SMALL(IF(Сотрудники!$H$3:$H$40=TRUE,ROW($E$1:$E$37)),ROW(E7))),\"\")","v":"Шарапов В."},{"$f":"IFERROR(IF(VLOOKUP(S7,KPI!I:R,10,FALSE)<1,$K$3+VLOOKUP(S7,KPI!I:L,4,FALSE),IF(VLOOKUP(S7,KPI!I:R,10,FALSE)=1,Расчеты!$L$3+VLOOKUP(S7,KPI!I:L,4,FALSE),IF(VLOOKUP(S7,KPI!I:R,10,FALSE)>1,Расчеты!$M$3*'pivot table'!$AQ$4+VLOOKUP(S7,KPI!I:L,4,FALSE),\"\"))),\"\")","v":23000}]
[{"$f":"IFERROR(INDEX(Сотрудники!$A$3:$A$40,SMALL(IF((Сотрудники!$C$3:$C$40=\"др\")*(Сотрудники!$G$3:$G$40=\"\"),ROW($E$1:$E$37)),ROW(E6))),\"\")","v":""},{"$f":"IFERROR(TEXT(VLOOKUP(A8,Сотрудники!A:C,2,FALSE),\"ДД МММ\"),\"\")","v":""},null,null,null,null,null,null,null,null,null,null,null,null,{"$f":"IFERROR(INDEX(Сотрудники!$A$3:$A$40,SMALL(IF((Сотрудники!$D$3:$D$40=\"Мастер\")*(Сотрудники!$G$3:$G$40=\"\"),ROW($E$1:$E$37)),ROW(E7))),\"\")","v":"Михалев И."},{"$f":"IFERROR(INDEX(Сотрудники!$A$3:$A$40,SMALL(IF((Сотрудники!$D$3:$D$40=\"Менеджер\")*(Сотрудники!$G$3:$G$40=\"\"),ROW($E$1:$E$37)),ROW(E7))),\"\")","v":""},null,null,{"$f":"IFERROR(INDEX(Сотрудники!$A$3:$A$40,SMALL(IF(Сотрудники!$H$3:$H$40=TRUE,ROW($E$1:$E$37)),ROW(E8))),\"\")","v":"Гончарова Н."},{"$f":"IFERROR(IF(VLOOKUP(S8,KPI!I:R,10,FALSE)<1,$K$3+VLOOKUP(S8,KPI!I:L,4,FALSE),IF(VLOOKUP(S8,KPI!I:R,10,FALSE)=1,Расчеты!$L$3+VLOOKUP(S8,KPI!I:L,4,FALSE),IF(VLOOKUP(S8,KPI!I:R,10,FALSE)>1,Расчеты!$M$3*'pivot table'!$AQ$4+VLOOKUP(S8,KPI!I:L,4,FALSE),\"\"))),\"\")","v":18000}]
{"$rows_left_out":18}